Reaction Details
TargetBroad substrate specificity ATP-binding cassette transporter ABCG2
LigandBDBM50338974
Substrate/Competitorn/a
Meas. Tech.ChEMBL_727299 (CHEMBL1687393)
IC50 390±n/a nM
Citation Pick, AMüller, HMayer, RHaenisch, BPajeva, IKWeigt, MBönisch, HMüller, CEWiese, M Structure-activity relationships of flavonoids as inhibitors of breast cancer resistance protein (BCRP). Bioorg Med Chem19:2090-102 (2011) 
 
Broad substrate specificity ATP-binding cassette transporter ABCG2
Name:Broad substrate specificity ATP-binding cassette transporter ABCG2
Type:Multi-pass membrane protein; monomer or homodimer; disulfide-linked
Mol. Mass.:72329.48
Organism:Homo sapiens (Human)
Description:Q9UNQ0
Residue:655
BDBM50338974
NameBDBM50338974
Synonyms:2-(3,4-Dimethoxy-phenyl)-5-hydroxy-3,7-dimethoxy-chromen-4-one 5-hydroxy-3,7,3,4-tetramethoxyflavone NSC-61837 quercitin-3,7,3',4'-tetramethyl ether | retusin
TypeSmall organic molecule
Emp. Form.C19H18O7
Mol. Mass.358.342
SMILESCOc1cc(O)c2c(c1)oc(-c1ccc(OC)c(OC)c1)c(OC)c2=O