Reaction Details
TargetRetinoic acid receptor RXR-alpha
LigandBDBM50339086
Substrate/Competitorn/a
Meas. Tech.ChEMBL_730141 (CHEMBL1696021)
EC50 450±n/a nM
Citation Ohsawa, FMorishita, KYamada, SMakishima, MKakuta, H Modification at the Lipophilic Domain of RXR Agonists Differentially Influences Activation of RXR Heterodimers. ACS Med Chem Lett1:521-525 (2010) 
 
Retinoic acid receptor RXR-alpha
Name:Retinoic acid receptor RXR-alpha
Type:PROTEIN
Mol. Mass.:50820.38
Organism:Homo sapiens (Human)
Description:ChEMBL_1456363
Residue:462
BDBM50339086
NameBDBM50339086
Synonyms:6-[Ethyl-(4-isopropyl-3-propoxyphenyl)amino]nicotinic acid | CHEMBL1688388
TypeSmall organic molecule
Emp. Form.C20H26N2O3
Mol. Mass.342.432
SMILESCCCOc1cc(ccc1C(C)C)N(CC)c1ccc(cn1)C(O)=O