Reaction Details
TargetExtracellular calcium-sensing receptor
LigandBDBM50339729
Substrate/Competitorn/a
Meas. Tech.ChEMBL_735492 (CHEMBL1692876)
IC50 2.2±n/a nM
Citation Yoshida, MMori, AMorimoto, SKotani, EOka, MNotoya, KMakino, HOno, MShirasaki, MTada, NFujita, HBan, JIkeda, YKawamoto, TGoto, MKimura, HBaba, AYasuma, T Novel and potent calcium-sensing receptor antagonists: discovery of (5R)-N-[1-ethyl-1-(4-ethylphenyl)propyl]-2,7,7-trimethyl-5-phenyl-4,5,6,7-tetrahydropyrazolo[1,5-a]pyrimidine-3-carboxamide monotosylate (TAK-075) as an orally active bone anabolic agent. Bioorg Med Chem19:1881-94 (2011) 
 
Extracellular calcium-sensing receptor
Name:Extracellular calcium-sensing receptor
Type:Protein
Mol. Mass.:120663.13
Organism:Homo sapiens (Human)
Description:P41180
Residue:1078
BDBM50339729
NameBDBM50339729
Synonyms:(5R)-N-{1-[4-(Benzyloxy)phenyl]-1-ethylpropyl}-2,7,7-trimethyl-5-phenyl-4,5,6,7-tetrahydropyrazolo[1,5-a]-pyrimidine-3-carboxamide hydrochloride | CHEMBL1689055
TypeSmall organic molecule
Emp. Form.C34H40N4O2
Mol. Mass.536.707
SMILESCCC(CC)(NC(=O)c1c(C)nn2c1N[C@H](CC2(C)C)c1ccccc1)c1ccc(OCc2ccccc2)cc1