Reaction Details
TargetExtracellular calcium-sensing receptor
LigandBDBM50339735
Substrate/Competitorn/a
Meas. Tech.ChEMBL_735492 (CHEMBL1692876)
IC50 4.7±n/a nM
Citation Yoshida, MMori, AMorimoto, SKotani, EOka, MNotoya, KMakino, HOno, MShirasaki, MTada, NFujita, HBan, JIkeda, YKawamoto, TGoto, MKimura, HBaba, AYasuma, T Novel and potent calcium-sensing receptor antagonists: discovery of (5R)-N-[1-ethyl-1-(4-ethylphenyl)propyl]-2,7,7-trimethyl-5-phenyl-4,5,6,7-tetrahydropyrazolo[1,5-a]pyrimidine-3-carboxamide monotosylate (TAK-075) as an orally active bone anabolic agent. Bioorg Med Chem19:1881-94 (2011) 
 
Extracellular calcium-sensing receptor
Name:Extracellular calcium-sensing receptor
Type:Protein
Mol. Mass.:120663.13
Organism:Homo sapiens (Human)
Description:P41180
Residue:1078
BDBM50339735
NameBDBM50339735
Synonyms:CHEMBL1689046 | rac-N-[1-Ethyl-1-(4-methylphenyl)propyl]-7,7-dimethyl-2-(methylthio)-5-phenyl-4,5,6,7-tetrahydropyrazolo[1,5-a]-pyrimidine-3-carboxamide hydrochloride
TypeSmall organic molecule
Emp. Form.C28H36N4OS
Mol. Mass.476.677
SMILESCCC(CC)(NC(=O)c1c(SC)nn2c1NC(CC2(C)C)c1ccccc1)c1ccc(C)cc1