Reaction Details
TargetExtracellular calcium-sensing receptor
LigandBDBM50339737
Substrate/Competitorn/a
Meas. Tech.ChEMBL_735492 (CHEMBL1692876)
IC50 6±n/a nM
Citation Yoshida, MMori, AMorimoto, SKotani, EOka, MNotoya, KMakino, HOno, MShirasaki, MTada, NFujita, HBan, JIkeda, YKawamoto, TGoto, MKimura, HBaba, AYasuma, T Novel and potent calcium-sensing receptor antagonists: discovery of (5R)-N-[1-ethyl-1-(4-ethylphenyl)propyl]-2,7,7-trimethyl-5-phenyl-4,5,6,7-tetrahydropyrazolo[1,5-a]pyrimidine-3-carboxamide monotosylate (TAK-075) as an orally active bone anabolic agent. Bioorg Med Chem19:1881-94 (2011) 
 
Extracellular calcium-sensing receptor
Name:Extracellular calcium-sensing receptor
Type:Protein
Mol. Mass.:120663.13
Organism:Homo sapiens (Human)
Description:P41180
Residue:1078
BDBM50339737
NameBDBM50339737
Synonyms:CHEMBL1689042 | rac-N-[1-Ethyl-1-(4-methylphenyl)propyl]-7,7-dimethyl-5-phenyl-2-propyl-4,5,6,7-tetrahydropyrazolo[1,5-a]pyrimidine-3-carboxamide hydrochloride
TypeSmall organic molecule
Emp. Form.C30H40N4O
Mol. Mass.472.6648
SMILESCCCc1nn2c(NC(CC2(C)C)c2ccccc2)c1C(=O)NC(CC)(CC)c1ccc(C)cc1