Reaction Details
TargetHeat shock protein HSP 90-alpha
LigandBDBM50340251
Substrate/Competitorn/a
Meas. Tech.ChEMBL_741463 (CHEMBL1763722)
IC50 210±n/a nM
Citation Zapf, CWBloom, JDMcBean, JLDushin, RGNittoli, TIngalls, CSutherland, AGSonye, JPEid, CNGolas, JLiu, HBoschelli, FHu, YVogan, ELevin, JI Design and SAR of macrocyclic Hsp90 inhibitors with increased metabolic stability and potent cell-proliferation activity. Bioorg Med Chem Lett21:2278-82 (2011) 
 
Heat shock protein HSP 90-alpha
Name:Heat shock protein HSP 90-alpha
Type:Molecular Chaperone
Mol. Mass.:84623.45
Organism:Homo sapiens (Human)
Description:P07900
Residue:732
BDBM50340251
NameBDBM50340251
Synonyms:CHEMBL1760603
TypeSmall organic molecule
Emp. Form.C24H32N4O2
Mol. Mass.408.5365
SMILESC[C@H]1CCNCCc2c(C)c3c(CC(C)(C)CC3=O)n2-c2ccc(C(N)=O)c(N1)c2