Reaction Details
TargetXanthine dehydrogenase/oxidase
LigandBDBM35440
Substrate/Competitorn/a
Meas. Tech.ChEMBL_740853 (CHEMBL1763954)
IC50 1900±n/a nM
Citation Cheng, JHHuang, AMHour, TCYang, SCPu, YSLin, CN Antioxidant xanthone derivatives induce cell cycle arrest and apoptosis and enhance cell death induced by cisplatin in NTUB1 cells associated with ROS. Eur J Med Chem46:1222-31 (2011) 
 
Xanthine dehydrogenase/oxidase
Name:Xanthine dehydrogenase/oxidase
Type:Enzyme
Mol. Mass.:146441.21
Organism:Homo sapiens (Human)
Description:P47989
Residue:1333
BDBM35440
NameBDBM35440
Synonyms:ALLOPURINOL SMR000059083 | cid_2094
TypeSmall organic molecule
Emp. Form.C5H4N4O
Mol. Mass.136.1115
SMILESO=c1[nH]cnc2n[nH]cc12