Reaction Details
TargetMu-type opioid receptor
LigandBDBM50341318
Substrate/Competitorn/a
Meas. Tech.ChEMBL_742675 (CHEMBL1769553)
Ki 2.0±n/a nM
Citation Yamamoto, TNair, PLargent-Milnes, TMJacobsen, NEDavis, PMa, SWYamamura, HIVanderah, TWPorreca, FLai, JHruby, VJ Discovery of a potent and efficacious peptide derivative ford/µ opioid agonist/neurokinin 1 antagonist activity with a 2',6'-dimethyl-L-tyrosine: in vitro, in vivo, and NMR-based structural studies. J Med Chem54:2029-38 (2011) 
 
Mu-type opioid receptor
Name:Mu-type opioid receptor
Type:G Protein-Coupled Receptor (GPCR)
Mol. Mass.:44503.11
Organism:Rattus norvegicus (rat)
Description:Competition binding assays were carried out using membrane preparations from transfected HN9.10 cells that constitutively expressed the mu opioid receptor.
Residue:398
BDBM50341318
NameBDBM50341318
Synonyms:(S)-1-((2S,5S,11R,14S)-14-amino-5-benzyl-15-(4-hydroxy-2,6-dimethylphenyl)-11-methyl-2-(2-(methylthio)ethyl)-4,7,10,13-tetraoxo-3,6,9,12-tetraazapentadecane)-N-((S)-1-((S)-1-(3,5-bis(trifluoromethyl)benzylamino)-3-(1H-indol-3-yl)-1-oxopropan-2-ylamino)-4-methyl-1-oxopentan-2-yl)pyrrolidine-2-carboxamide | CHEMBL1766208
TypeSmall organic molecule
Emp. Form.C61H74F6N10O9S
Mol. Mass.1237.357
SMILESCSCC[C@H](NC(=O)[C@H](Cc1ccccc1)NC(=O)CNC(=O)[C@@H](C)NC(=O)[C@@H](N)Cc1c(C)cc(O)cc1C)C(=O)N1CCC[C@H]1C(=O)N[C@@H](CC(C)C)C(=O)N[C@@H](Cc1c[nH]c2ccccc12)C(=O)NCc1cc(cc(c1)C(F)(F)F)C(F)(F)F