Reaction Details
TargetCytochrome P450 2D6
LigandBDBM50341447
Substrate/Competitorn/a
Meas. Tech.ChEMBL_741719 (CHEMBL1769765)
IC50 40±n/a nM
Citation Procopiou, PABrowning, CBuckley, JMClark, KLFechner, LGore, PMHancock, APHodgson, STHolmes, DSKranz, MLooker, BEMorriss, KMParton, DLRussell, LJSlack, RJSollis, SLVile, SWatts, CJ The discovery of phthalazinone-based human H1 and H3 single-ligand antagonists suitable for intranasal administration for the treatment of allergic rhinitis. J Med Chem54:2183-95 (2011) 
 
Cytochrome P450 2D6
Name:Cytochrome P450 2D6
Type:Protein
Mol. Mass.:55774.82
Organism:Homo sapiens (Human)
Description:P10635
Residue:497
BDBM50341447
NameBDBM50341447
Synonyms:4-[(4-Chlorophenyl)methyl]-2-({(2R)-1-[4-(4-{[3-(hexahydro-1H-azepin-1-yl)propyl]oxy}phenyl)butyl]-2-pyrrolidinyl}methyl)-1(2H)-phthalazinone | CHEMBL1767164
TypeSmall organic molecule
Emp. Form.C39H49ClN4O2
Mol. Mass.641.285
SMILESClc1ccc(Cc2nn(C[C@H]3CCCN3CCCCc3ccc(OCCCN4CCCCCC4)cc3)c(=O)c3ccccc23)cc1