Reaction Details
TargetHistamine H1 receptor
LigandBDBM50418276
Substrate/Competitorn/a
Meas. Tech.ChEMBL_741663 (CHEMBL1769655)
Ki 398.11±n/a nM
Citation Procopiou, PABrowning, CBuckley, JMClark, KLFechner, LGore, PMHancock, APHodgson, STHolmes, DSKranz, MLooker, BEMorriss, KMParton, DLRussell, LJSlack, RJSollis, SLVile, SWatts, CJ The discovery of phthalazinone-based human H1 and H3 single-ligand antagonists suitable for intranasal administration for the treatment of allergic rhinitis. J Med Chem54:2183-95 (2011) 
 
Histamine H1 receptor
Name:Histamine H1 receptor
Type:G Protein-Coupled Receptor (GPCR)
Mol. Mass.:55808.72
Organism:Homo sapiens (Human)
Description:Cell pellets from SK-N-MC cells transfected with human H1 receptor were used in binding assay.
Residue:487
BDBM50418276
NameBDBM50418276
Synonyms:CHEMBL1767142
TypeSmall organic molecule
Emp. Form.C25H31N3O
Mol. Mass.389.5331
SMILESCN1CCC[C@@H]1Cn1nc(Cc2ccc(cc2)C(C)(C)C)c2ccccc2c1=O