Reaction Details
TargetDipeptidyl peptidase 4
LigandBDBM50341487
Substrate/Competitorn/a
Meas. Tech.ChEMBL_742294 (CHEMBL1768627)
pH7.4±n/a
IC50 0.7±n/a nM
Commentsextracted
Citation Poplawski, SELai, JHSanford, DGSudmeier, JLWu, WBachovchin, WW Pro-soft Val-boroPro: a strategy for enhancing in vivo performance of boronic acid inhibitors of serine proteases. J Med Chem54:2022-8 (2011) 
 
Dipeptidyl peptidase 4
Name:Dipeptidyl peptidase 4
Type:Enzyme
Mol. Mass.:88271.01
Organism:Homo sapiens (Human)
Description:P27487
Residue:766
BDBM50341487
NameBDBM50341487
Synonyms:CHEMBL1765236 | Succinyl-alaninyl-alaninyl-prolinyl-phenylalaninyl-alaninyl-L-boroproline
TypeSmall organic molecule
Emp. Form.C31H45BN6O10
Mol. Mass.672.534
SMILESC[C@H](NC(=O)CCC(O)=O)C(=O)N[C@@H](C)C(=O)N1CCC[C@H]1C(=O)N[C@@H](Cc1ccccc1)C(=O)N[C@@H](C)C(=O)N1CCC[C@H]1B(O)O