Reaction Details
TargetDipeptidyl peptidase 4
LigandBDBM50050525
Substrate/Competitorn/a
Meas. Tech.ChEMBL_742293 (CHEMBL1768626)
pH7.4±n/a
IC50 1600±n/a nM
Commentsextracted
Citation Poplawski, SELai, JHSanford, DGSudmeier, JLWu, WBachovchin, WW Pro-soft Val-boroPro: a strategy for enhancing in vivo performance of boronic acid inhibitors of serine proteases. J Med Chem54:2022-8 (2011) 
 
Dipeptidyl peptidase 4
Name:Dipeptidyl peptidase 4
Type:Enzyme
Mol. Mass.:88271.01
Organism:Homo sapiens (Human)
Description:P27487
Residue:766
BDBM50050525
NameBDBM50050525
Synonyms:(R)-1-((S)-2-aminopropanoyl)pyrrolidin-2-ylboronic acid CHEMBL63860 US11559537, Compound 1129 US8933056, Asp-boroPro
TypeSmall organic molecule
Emp. Form.C7H15BN2O3
Mol. Mass.186.017
SMILESC[C@H](N)C(=O)N1CCC[C@H]1B(O)O