Reaction Details
TargetSteroidogenic factor 1
LigandBDBM50418308
Substrate/Competitorn/a
Meas. Tech.ChEMBL_743680 (CHEMBL1767449)
EC50 63.1±n/a nM
Citation Whitby, RJStec, JBlind, RDDixon, SLeesnitzer, LMOrband-Miller, LAWilliams, SPWillson, TMXu, RZuercher, WJCai, FIngraham, HA Small molecule agonists of the orphan nuclear receptors steroidogenic factor-1 (SF-1, NR5A1) and liver receptor homologue-1 (LRH-1, NR5A2). J Med Chem54:2266-81 (2011) 
 
Steroidogenic factor 1
Name:Steroidogenic factor 1
Type:Nuclear Hormone Receptor
Mol. Mass.:51643.43
Organism:Homo sapiens (Human)
Description:n/a
Residue:461
BDBM50418308
NameBDBM50418308
Synonyms:CHEMBL1765933
TypeSmall organic molecule
Emp. Form.C28H34
Mol. Mass.370.5696
SMILESCCCCCCC1=C(c2ccccc2)[C@@]2(CCC[C@@H]2C1)C(=C)c1ccccc1