Reaction Details
TargetNuclear receptor subfamily 5 group A member 2
LigandBDBM50418312
Substrate/Competitorn/a
Meas. Tech.ChEMBL_743679 (CHEMBL1767448)
EC50 100±n/a nM
Citation Whitby, RJStec, JBlind, RDDixon, SLeesnitzer, LMOrband-Miller, LAWilliams, SPWillson, TMXu, RZuercher, WJCai, FIngraham, HA Small molecule agonists of the orphan nuclear receptors steroidogenic factor-1 (SF-1, NR5A1) and liver receptor homologue-1 (LRH-1, NR5A2). J Med Chem54:2266-81 (2011) 
 
Nuclear receptor subfamily 5 group A member 2
Name:Nuclear receptor subfamily 5 group A member 2
Type:Nuclear Hormone Receptor
Mol. Mass.:61341.37
Organism:Homo sapiens (Human)
Description:n/a
Residue:541
BDBM50418312
NameBDBM50418312
Synonyms:CHEMBL1765932
TypeSmall organic molecule
Emp. Form.C27H34O
Mol. Mass.374.5583
SMILESCCCCCCC1=C(c2ccccc2)[C@@]2(CCC[C@@H]2C1)OCc1ccccc1