Reaction Details
TargetSteroidogenic factor 1
LigandBDBM50418313
Substrate/Competitorn/a
Meas. Tech.ChEMBL_743680 (CHEMBL1767449)
EC50 125.89±n/a nM
Citation Whitby, RJStec, JBlind, RDDixon, SLeesnitzer, LMOrband-Miller, LAWilliams, SPWillson, TMXu, RZuercher, WJCai, FIngraham, HA Small molecule agonists of the orphan nuclear receptors steroidogenic factor-1 (SF-1, NR5A1) and liver receptor homologue-1 (LRH-1, NR5A2). J Med Chem54:2266-81 (2011) 
 
Steroidogenic factor 1
Name:Steroidogenic factor 1
Type:Nuclear Hormone Receptor
Mol. Mass.:51643.43
Organism:Homo sapiens (Human)
Description:n/a
Residue:461
BDBM50418313
NameBDBM50418313
Synonyms:CHEMBL1765945
TypeSmall organic molecule
Emp. Form.C29H36O
Mol. Mass.400.5955
SMILESCCCCCCC1=C(c2cccc(OC)c2)[C@@]2(CCC[C@@H]2C1)C(=C)c1ccccc1