Reaction Details
TargetSteroidogenic factor 1
LigandBDBM22373
Substrate/Competitorn/a
Meas. Tech.ChEMBL_743680 (CHEMBL1767449)
EC50 158.49±n/a nM
Citation Whitby, RJStec, JBlind, RDDixon, SLeesnitzer, LMOrband-Miller, LAWilliams, SPWillson, TMXu, RZuercher, WJCai, FIngraham, HA Small molecule agonists of the orphan nuclear receptors steroidogenic factor-1 (SF-1, NR5A1) and liver receptor homologue-1 (LRH-1, NR5A2). J Med Chem54:2266-81 (2011) 
 
Steroidogenic factor 1
Name:Steroidogenic factor 1
Type:Nuclear Hormone Receptor
Mol. Mass.:51643.43
Organism:Homo sapiens (Human)
Description:n/a
Residue:461
BDBM22373
NameBDBM22373
Synonyms:(3aS,6aR)-5-[(4E)-oct-4-en-4-yl]-N,4-diphenyl-1,2,3,3a,6,6a-hexahydropentalen-3a-amine bicyclo[3.3.0]-oct-2-ene, 5a
TypeSmall organic molecule
Emp. Form.C28H35N
Mol. Mass.385.5842
SMILES[H][C@]12CCC[C@@]1(Nc1ccccc1)C(=C(C2)C(\CCC)=C\CCC)c1ccccc1