Reaction Details
TargetDiacylglycerol O-acyltransferase 1
LigandBDBM50341767
Substrate/Competitorn/a
Meas. Tech.ChEMBL_743546 (CHEMBL1767987)
IC50 202±n/a nM
Citation Qian, YWertheimer, SJAhmad, MCheung, AWFirooznia, FHamilton, MMHayden, SLi, SMarcopulos, NMcDermott, LTan, JYun, WGuo, LPamidimukkala, AChen, YHuang, KSRamsey, GBWhittard, TConde-Knape, KTaub, RRondinone, CMTilley, JBolin, D Discovery of orally active carboxylic acid derivatives of 2-phenyl-5-trifluoromethyloxazole-4-carboxamide as potent diacylglycerol acyltransferase-1 inhibitors for the potential treatment of obesity and diabetes. J Med Chem54:2433-46 (2011) 
 
Diacylglycerol O-acyltransferase 1
Name:Diacylglycerol O-acyltransferase 1
Type:Protein
Mol. Mass.:55297.82
Organism:Homo sapiens (Human)
Description:O75907
Residue:488
BDBM50341767
NameBDBM50341767
Synonyms:(1-{5-[(2-Phenyl-5-trifluoromethyloxazole-4-carbonyl)-amino]pyridin-2-yl}azetidin-3-yloxy)acetic Acid | CHEMBL1766885
TypeSmall organic molecule
Emp. Form.C21H17F3N4O5
Mol. Mass.462.3787
SMILESOC(=O)COC1CN(C1)c1ccc(NC(=O)c2nc(oc2C(F)(F)F)-c2ccccc2)cn1