Reaction Details
TargetDiacylglycerol O-acyltransferase 1
LigandBDBM50341784
Substrate/Competitorn/a
Meas. Tech.ChEMBL_743559 (CHEMBL1768059)
IC50 44±n/a nM
Citation Qian, YWertheimer, SJAhmad, MCheung, AWFirooznia, FHamilton, MMHayden, SLi, SMarcopulos, NMcDermott, LTan, JYun, WGuo, LPamidimukkala, AChen, YHuang, KSRamsey, GBWhittard, TConde-Knape, KTaub, RRondinone, CMTilley, JBolin, D Discovery of orally active carboxylic acid derivatives of 2-phenyl-5-trifluoromethyloxazole-4-carboxamide as potent diacylglycerol acyltransferase-1 inhibitors for the potential treatment of obesity and diabetes. J Med Chem54:2433-46 (2011) 
 
Diacylglycerol O-acyltransferase 1
Name:Diacylglycerol O-acyltransferase 1
Type:Protein
Mol. Mass.:55297.82
Organism:Homo sapiens (Human)
Description:O75907
Residue:488
BDBM50341784
NameBDBM50341784
Synonyms:CHEMBL1766894 | N-(2-(2-phenyl-5-(trifluoromethyl)-1H-imidazole-4-carboxamido)ethyl)-6-(2,2,2-trifluoroethoxy)nicotinamide
TypeSmall organic molecule
Emp. Form.C21H17F6N5O3
Mol. Mass.501.3818
SMILESFC(F)(F)COc1ccc(cn1)C(=O)NCCNC(=O)c1[nH]c(nc1C(F)(F)F)-c1ccccc1