Reaction Details
TargetIsoform 4 of Lethal(3)malignant brain tumor-like protein 1 (4)
LigandBDBM50341831
Substrate/Competitorn/a
Meas. Tech.ChEMBL_743614 (CHEMBL1768157)
Kd 3.7E4±n/a nM
Citation Herold, JMWigle, TJNorris, JLLam, RKorboukh, VKGao, CIngerman, LAKireev, DBSenisterra, GVedadi, MTripathy, ABrown, PJArrowsmith, CHJin, JJanzen, WPFrye, SV Small-molecule ligands of methyl-lysine binding proteins. J Med Chem54:2504-11 (2011) 
 
Isoform 4 of Lethal(3)malignant brain tumor-like protein 1 (4)
Name:Isoform 4 of Lethal(3)malignant brain tumor-like protein 1 (4)
Type:Protein
Mol. Mass.:83871.06
Organism:Homo sapiens (Human)
Description:Q9Y468-4
Residue:752
BDBM50341831
NameBDBM50341831
Synonyms:(S)-2-amino-3-(1H-imidazol-4-yl)-N-((S)-1-oxo-3-phenyl-1-(5-(pyrrolidin-1-yl)pentylamino)propan-2-yl)propanamide | CHEMBL1767021
TypeSmall organic molecule
Emp. Form.C24H36N6O2
Mol. Mass.440.5816
SMILESN[C@@H](Cc1cnc[nH]1)C(=O)N[C@@H](Cc1ccccc1)C(=O)NCCCCCN1CCCC1