Reaction Details
TargetFatty-acid amide hydrolase 1
LigandBDBM50342059
Substrate/Competitorn/a
Meas. Tech.ChEMBL_743931 (CHEMBL1767925)
Ki 7.2±n/a nM
Citation Ezzili, CMileni, MMcGlinchey, NLong, JZKinsey, SGHochstatter, DGStevens, RCLichtman, AHCravatt, BFBilsky, EJBoger, DL Reversible competitivea-ketoheterocycle inhibitors of fatty acid amide hydrolase containing additional conformational constraints in the acyl side chain: orally active, long-acting analgesics. J Med Chem54:2805-22 (2011) 
 
Fatty-acid amide hydrolase 1
Name:Fatty-acid amide hydrolase 1
Type:Protein
Mol. Mass.:63071.19
Organism:Homo sapiens (Human)
Description:O00519
Residue:579
BDBM50342059
NameBDBM50342059
Synonyms:(S)-(6-phenyl-1,2,3,4-tetrahydronaphthalen-2-yl)(5-(pyridin-2-yl)oxazol-2-yl)methanone | CHEMBL1765825
TypeSmall organic molecule
Emp. Form.C25H20N2O2
Mol. Mass.380.4385
SMILESO=C([C@H]1CCc2cc(ccc2C1)-c1ccccc1)c1ncc(o1)-c1ccccn1