Reaction Details
TargetFatty-acid amide hydrolase 1
LigandBDBM50342061
Substrate/Competitorn/a
Meas. Tech.ChEMBL_743931 (CHEMBL1767925)
Ki 39±n/a nM
Citation Ezzili, CMileni, MMcGlinchey, NLong, JZKinsey, SGHochstatter, DGStevens, RCLichtman, AHCravatt, BFBilsky, EJBoger, DL Reversible competitivea-ketoheterocycle inhibitors of fatty acid amide hydrolase containing additional conformational constraints in the acyl side chain: orally active, long-acting analgesics. J Med Chem54:2805-22 (2011) 
 
Fatty-acid amide hydrolase 1
Name:Fatty-acid amide hydrolase 1
Type:Protein
Mol. Mass.:63071.19
Organism:Homo sapiens (Human)
Description:O00519
Residue:579
BDBM50342061
NameBDBM50342061
Synonyms:(S)-6-(2-(6-phenyl-1,2,3,4-tetrahydronaphthalene-2-carbonyl)oxazol-5-yl)picolinic acid | CHEMBL1765827
TypeSmall organic molecule
Emp. Form.C26H20N2O4
Mol. Mass.424.448
SMILESOC(=O)c1cccc(n1)-c1cnc(o1)C(=O)[C@H]1CCc2cc(ccc2C1)-c1ccccc1