Reaction Details
TargetFatty-acid amide hydrolase 1
LigandBDBM50342088
Substrate/Competitorn/a
Meas. Tech.ChEMBL_743931 (CHEMBL1767925)
Ki 120±n/a nM
Citation Ezzili, CMileni, MMcGlinchey, NLong, JZKinsey, SGHochstatter, DGStevens, RCLichtman, AHCravatt, BFBilsky, EJBoger, DL Reversible competitivea-ketoheterocycle inhibitors of fatty acid amide hydrolase containing additional conformational constraints in the acyl side chain: orally active, long-acting analgesics. J Med Chem54:2805-22 (2011) 
 
Fatty-acid amide hydrolase 1
Name:Fatty-acid amide hydrolase 1
Type:Protein
Mol. Mass.:63071.19
Organism:Homo sapiens (Human)
Description:O00519
Residue:579
BDBM50342088
NameBDBM50342088
Synonyms:(R)-2-(6-(benzyloxy)-1,2,3,4-tetrahydronaphthalene-2-carbonyl)oxazole-5-carbonitrile | CHEMBL1765854
TypeSmall organic molecule
Emp. Form.C22H18N2O3
Mol. Mass.358.3899
SMILESO=C([C@@H]1CCc2cc(OCc3ccccc3)ccc2C1)c1ncc(o1)C#N