Reaction Details
TargetFatty-acid amide hydrolase 1
LigandBDBM50342093
Substrate/Competitorn/a
Meas. Tech.ChEMBL_743931 (CHEMBL1767925)
Ki 4.1±n/a nM
Citation Ezzili, CMileni, MMcGlinchey, NLong, JZKinsey, SGHochstatter, DGStevens, RCLichtman, AHCravatt, BFBilsky, EJBoger, DL Reversible competitivea-ketoheterocycle inhibitors of fatty acid amide hydrolase containing additional conformational constraints in the acyl side chain: orally active, long-acting analgesics. J Med Chem54:2805-22 (2011) 
 
Fatty-acid amide hydrolase 1
Name:Fatty-acid amide hydrolase 1
Type:Protein
Mol. Mass.:63071.19
Organism:Homo sapiens (Human)
Description:O00519
Residue:579
BDBM50342093
NameBDBM50342093
Synonyms:(S)-(6-(benzyloxy)-1,2,3,4-tetrahydronaphthalen-2-yl)(5-iodooxazol-2-yl)methanone | CHEMBL1765859
TypeSmall organic molecule
Emp. Form.C21H18INO3
Mol. Mass.459.277
SMILESIc1cnc(o1)C(=O)[C@H]1CCc2cc(OCc3ccccc3)ccc2C1