Reaction Details
TargetFatty-acid amide hydrolase 1
LigandBDBM50342110
Substrate/Competitorn/a
Meas. Tech.ChEMBL_743931 (CHEMBL1767925)
Ki 42±n/a nM
Citation Ezzili, CMileni, MMcGlinchey, NLong, JZKinsey, SGHochstatter, DGStevens, RCLichtman, AHCravatt, BFBilsky, EJBoger, DL Reversible competitivea-ketoheterocycle inhibitors of fatty acid amide hydrolase containing additional conformational constraints in the acyl side chain: orally active, long-acting analgesics. J Med Chem54:2805-22 (2011) 
 
Fatty-acid amide hydrolase 1
Name:Fatty-acid amide hydrolase 1
Type:Protein
Mol. Mass.:63071.19
Organism:Homo sapiens (Human)
Description:O00519
Residue:579
BDBM50342110
NameBDBM50342110
Synonyms:(R)-(5-phenoxy-2,3-dihydro-1H-inden-2-yl)(5-(pyridin-2-yl)oxazol-2-yl)methanone | CHEMBL1765875
TypeSmall organic molecule
Emp. Form.C24H18N2O3
Mol. Mass.382.4113
SMILESO=C([C@@H]1Cc2ccc(Oc3ccccc3)cc2C1)c1ncc(o1)-c1ccccn1