Reaction Details
TargetFatty-acid amide hydrolase 1
LigandBDBM50342113
Substrate/Competitorn/a
Meas. Tech.ChEMBL_743931 (CHEMBL1767925)
Ki 110±n/a nM
Citation Ezzili, CMileni, MMcGlinchey, NLong, JZKinsey, SGHochstatter, DGStevens, RCLichtman, AHCravatt, BFBilsky, EJBoger, DL Reversible competitivea-ketoheterocycle inhibitors of fatty acid amide hydrolase containing additional conformational constraints in the acyl side chain: orally active, long-acting analgesics. J Med Chem54:2805-22 (2011) 
 
Fatty-acid amide hydrolase 1
Name:Fatty-acid amide hydrolase 1
Type:Protein
Mol. Mass.:63071.19
Organism:Homo sapiens (Human)
Description:O00519
Residue:579
BDBM50342113
NameBDBM50342113
Synonyms:(R)-(5-(benzyloxy)-2,3-dihydro-1H-inden-2-yl)(5-(pyridin-2-yl)oxazol-2-yl)methanone | CHEMBL1765979
TypeSmall organic molecule
Emp. Form.C25H20N2O3
Mol. Mass.396.4379
SMILESO=C([C@@H]1Cc2ccc(OCc3ccccc3)cc2C1)c1ncc(o1)-c1ccccn1