Reaction Details
TargetFatty-acid amide hydrolase 1
LigandBDBM50342114
Substrate/Competitorn/a
Meas. Tech.ChEMBL_743931 (CHEMBL1767925)
Ki 130±n/a nM
Citation Ezzili, CMileni, MMcGlinchey, NLong, JZKinsey, SGHochstatter, DGStevens, RCLichtman, AHCravatt, BFBilsky, EJBoger, DL Reversible competitivea-ketoheterocycle inhibitors of fatty acid amide hydrolase containing additional conformational constraints in the acyl side chain: orally active, long-acting analgesics. J Med Chem54:2805-22 (2011) 
 
Fatty-acid amide hydrolase 1
Name:Fatty-acid amide hydrolase 1
Type:Protein
Mol. Mass.:63071.19
Organism:Homo sapiens (Human)
Description:O00519
Residue:579
BDBM50342114
NameBDBM50342114
Synonyms:(R)-methyl 6-(2-(5-(benzyloxy)-2,3-dihydro-1H-indene-2-carbonyl)oxazol-5-yl)picolinate | CHEMBL1765980
TypeSmall organic molecule
Emp. Form.C27H22N2O5
Mol. Mass.454.474
SMILESCOC(=O)c1cccc(n1)-c1cnc(o1)C(=O)[C@@H]1Cc2ccc(OCc3ccccc3)cc2C1