Reaction Details
TargetFatty-acid amide hydrolase 1 [30-579]
LigandBDBM50342065
Substrate/Competitorn/a
Meas. Tech.ChEMBL_743932 (CHEMBL1767926)
Ki 4.4±n/a nM
Citation Ezzili, CMileni, MMcGlinchey, NLong, JZKinsey, SGHochstatter, DGStevens, RCLichtman, AHCravatt, BFBilsky, EJBoger, DL Reversible competitivea-ketoheterocycle inhibitors of fatty acid amide hydrolase containing additional conformational constraints in the acyl side chain: orally active, long-acting analgesics. J Med Chem54:2805-22 (2011) 
 
Fatty-acid amide hydrolase 1 [30-579]
Name:Fatty-acid amide hydrolase 1 [30-579]
Type:Single-pass membrane protein; homodimer
Mol. Mass.:60474.00
Organism:Rattus norvegicus (rat)
Description:P97612 (aa 30-579)
Residue:550
BDBM50342065
NameBDBM50342065
Synonyms:(S)-(6-phenoxy-1,2,3,4-tetrahydronaphthalen-2-yl)(5-(pyridin-2-yl)oxazol-2-yl)methanone | CHEMBL1765831
TypeSmall organic molecule
Emp. Form.C25H20N2O3
Mol. Mass.396.4379
SMILESO=C([C@H]1CCc2cc(Oc3ccccc3)ccc2C1)c1ncc(o1)-c1ccccn1