Reaction Details
TargetFatty-acid amide hydrolase 1 [30-579]
LigandBDBM50342067
Substrate/Competitorn/a
Meas. Tech.ChEMBL_743932 (CHEMBL1767926)
Ki 25±n/a nM
Citation Ezzili, CMileni, MMcGlinchey, NLong, JZKinsey, SGHochstatter, DGStevens, RCLichtman, AHCravatt, BFBilsky, EJBoger, DL Reversible competitivea-ketoheterocycle inhibitors of fatty acid amide hydrolase containing additional conformational constraints in the acyl side chain: orally active, long-acting analgesics. J Med Chem54:2805-22 (2011) 
 
Fatty-acid amide hydrolase 1 [30-579]
Name:Fatty-acid amide hydrolase 1 [30-579]
Type:Single-pass membrane protein; homodimer
Mol. Mass.:60474.00
Organism:Rattus norvegicus (rat)
Description:P97612 (aa 30-579)
Residue:550
BDBM50342067
NameBDBM50342067
Synonyms:(S)-6-(2-(6-phenoxy-1,2,3,4-tetrahydronaphthalene-2-carbonyl)oxazol-5-yl)picolinic acid | CHEMBL1765833
TypeSmall organic molecule
Emp. Form.C26H20N2O5
Mol. Mass.440.4474
SMILESOC(=O)c1cccc(n1)-c1cnc(o1)C(=O)[C@H]1CCc2cc(Oc3ccccc3)ccc2C1