Reaction Details
TargetSolute carrier family 22 member 12
LigandBDBM50158460
Substrate/Competitorn/a
Meas. Tech.ChEMBL_743866 (CHEMBL1767809)
IC50 35±n/a nM
Citation Wempe, MFJutabha, PQuade, BIwen, TJFrick, MMRoss, IRRice, PJAnzai, NEndou, H Developing potent human uric acid transporter 1 (hURAT1) inhibitors. J Med Chem54:2701-13 (2011) 
 
Solute carrier family 22 member 12
Name:Solute carrier family 22 member 12
Type:Enzyme
Mol. Mass.:59638.65
Organism:Homo sapiens (Human)
Description:Q96S37
Residue:553
BDBM50158460
NameBDBM50158460
Synonyms:(3,5-dibromo-4-hydroxyphenyl)(2-ethyl-1-benzofuran-3-yl)methanone 3,5-dibromo-4-hydroxyphenyl-2-ethyl-3-benzofuranyl ketone CHEMBL388590 US9856239, benzbromarone Uroleap (TN) | cid_2333
TypeSmall organic molecule
Emp. Form.C17H12Br2O3
Mol. Mass.424.083
SMILESCCc1oc2ccccc2c1C(=O)c1cc(Br)c(O)c(Br)c1