Reaction Details
TargetProtein-glutamine gamma-glutamyltransferase 2
LigandBDBM50342562
Substrate/Competitorn/a
Meas. Tech.ChEMBL_744966 (CHEMBL1771981)
Ki 700±n/a nM
Citation Klöck, CJin, XChoi, KKhosla, CMadrid, PBSpencer, ARaimundo, BCBoardman, PLanza, GGriffin, JH Acylideneoxoindoles: a new class of reversible inhibitors of human transglutaminase 2. Bioorg Med Chem Lett21:2692-6 (2011) 
 
Protein-glutamine gamma-glutamyltransferase 2
Name:Protein-glutamine gamma-glutamyltransferase 2
Type:Protein
Mol. Mass.:77309.30
Organism:Homo sapiens (Human)
Description:P21980
Residue:687
BDBM50342562
NameBDBM50342562
Synonyms:(E)-4-chloro-3-(2-oxopropylidene)indolin-2-one | CHEMBL1770394
TypeSmall organic molecule
Emp. Form.C11H8ClNO2
Mol. Mass.221.64
SMILESCC(=O)C=C1C(=O)Nc2cccc(Cl)c12