Reaction Details
TargetProtein-glutamine gamma-glutamyltransferase 2
LigandBDBM50342564
Substrate/Competitorn/a
Meas. Tech.ChEMBL_744966 (CHEMBL1771981)
Ki 5400±n/a nM
Citation Klöck, CJin, XChoi, KKhosla, CMadrid, PBSpencer, ARaimundo, BCBoardman, PLanza, GGriffin, JH Acylideneoxoindoles: a new class of reversible inhibitors of human transglutaminase 2. Bioorg Med Chem Lett21:2692-6 (2011) 
 
Protein-glutamine gamma-glutamyltransferase 2
Name:Protein-glutamine gamma-glutamyltransferase 2
Type:Protein
Mol. Mass.:77309.30
Organism:Homo sapiens (Human)
Description:P21980
Residue:687
BDBM50342564
NameBDBM50342564
Synonyms:(E)-6-fluoro-3-(2-oxopropylidene)indolin-2-one | CHEMBL1770396
TypeSmall organic molecule
Emp. Form.C11H8FNO2
Mol. Mass.205.1851
SMILESCC(=O)C=C1C(=O)Nc2cc(F)ccc12