Reaction Details
TargetAcetylcholinesterase
LigandBDBM50342606
Substrate/Competitorn/a
Meas. Tech.ChEMBL_744973 (CHEMBL1771988)
IC50>10000±n/a nM
Citation Bolognesi, MLBartolini, MTarozzi, AMorroni, FLizzi, FMilelli, AMinarini, ARosini, MHrelia, PAndrisano, VMelchiorre, C Multitargeted drugs discovery: balancing anti-amyloid and anticholinesterase capacity in a single chemical entity. Bioorg Med Chem Lett21:2655-8 (2011) 
 
Acetylcholinesterase
Name:Acetylcholinesterase
Type:Enzyme
Mol. Mass.:67792.70
Organism:Homo sapiens (Human)
Description:P22303
Residue:614
BDBM50342606
NameBDBM50342606
Synonyms:2,5-bis(3-(benzo[d]thiazol-2-ylmethylamino)propylamino)cyclohexa-2,5-diene-1,4-dione | CHEMBL1770552
TypeSmall organic molecule
Emp. Form.C28H30N6O2S2
Mol. Mass.546.707
SMILESOc1cc(N=CCCNCc2nc3ccccc3s2)c(O)cc1NCCCNCc1nc2ccccc2s1