Reaction Details
TargetCholinesterase
LigandBDBM50342604
Substrate/Competitorn/a
Meas. Tech.ChEMBL_744974 (CHEMBL1771989)
IC50 2600±n/a nM
Citation Bolognesi, MLBartolini, MTarozzi, AMorroni, FLizzi, FMilelli, AMinarini, ARosini, MHrelia, PAndrisano, VMelchiorre, C Multitargeted drugs discovery: balancing anti-amyloid and anticholinesterase capacity in a single chemical entity. Bioorg Med Chem Lett21:2655-8 (2011) 
 
Cholinesterase
Name:Cholinesterase
Type:Homotetramer
Mol. Mass.:68422.27
Organism:Homo sapiens (Human)
Description:P06276
Residue:602
BDBM50342604
NameBDBM50342604
Synonyms:2,5-bis(3-(benzofuran-2-ylmethylamino)propylamino)cyclohexa-2,5-diene-1,4-dione | CHEMBL1770550
TypeSmall organic molecule
Emp. Form.C30H32N4O4
Mol. Mass.512.5995
SMILESOc1cc(N=CCCNCc2cc3ccccc3o2)c(O)cc1NCCCNCc1cc2ccccc2o1