Reaction Details
TargetPhospho-N-acetylmuramoyl-pentapeptide-transferase
LigandBDBM50342782
Substrate/Competitorn/a
Meas. Tech.ChEMBL_744419 (CHEMBL1772373)
IC50 220000±n/a nM
Citation Mravljak, JMonasson, OAl-Dabbagh, BCrouvoisier, MBouhss, AGravier-Pelletier, CLe Merrer, Y Synthesis and biological evaluation of a diazepanone-based library of liposidomycins analogs as MraY inhibitors. Eur J Med Chem46:1582-92 (2011) 
 
Phospho-N-acetylmuramoyl-pentapeptide-transferase
Name:Phospho-N-acetylmuramoyl-pentapeptide-transferase
Type:PROTEIN
Mol. Mass.:35238.55
Organism:Staphylococcus aureus (strain MRSA252)
Description:ChEMBL_827497
Residue:321
BDBM50342782
NameBDBM50342782
Synonyms:(3S,6S,7R)-3-(5-Amino-5-deoxy-beta-D-ribos-1-yl-methyl)-7-hydroxymethyl-4-N-(5''-(uracil-1'-yl)pentyl)-6-palmitoyloxy-1,4-diazepan-2-one | CHEMBL1770417
TypeSmall organic molecule
Emp. Form.C37H65N5O10
Mol. Mass.739.9395
(=O)O[C@H]1CN(CCCCCn2ccc(=O)[nH]c2=O)[C@@H](CO[C@@H]2O[C@H](CN)[C@@H](O)[C@H]2O)C(=O)N[C@@H]1CO