Reaction Details
TargetSodium/glucose cotransporter 1
LigandBDBM50342887
Substrate/Competitorn/a
Meas. Tech.ChEMBL_745218 (CHEMBL1772494)
IC50 546±n/a nM
Citation Mascitti, VMaurer, TSRobinson, RPBian, JBoustany-Kari, CMBrandt, TCollman, BMKalgutkar, ASKlenotic, MKLeininger, MTLowe, AMaguire, RJMasterson, VMMiao, ZMukaiyama, EPatel, JDPettersen, JCPréville, CSamas, BShe, LSobol, ZSteppan, CMStevens, BDThuma, BATugnait, MZeng, DZhu, T Discovery of a clinical candidate from the structurally unique dioxa-bicyclo[3.2.1]octane class of sodium-dependent glucose cotransporter 2 inhibitors. J Med Chem54:2952-60 (2011) 
 
Sodium/glucose cotransporter 1
Name:Sodium/glucose cotransporter 1
Type:Protein
Mol. Mass.:73503.78
Organism:Homo sapiens (Human)
Description:P13866
Residue:664
BDBM50342887
NameBDBM50342887
Synonyms:(1S,2S,3S,4R,5S)-5-[4-Chloro-3-(4-methoxybenzyl)phenyl]-1-(hydroxymethyl)-6,8-dioxa-bicyclo[3.2.1]octane-2,3,4-triol | CHEMBL1770246
TypeSmall organic molecule
Emp. Form.C21H23ClO7
Mol. Mass.422.856
SMILESCOc1ccc(Cc2cc(ccc2Cl)[C@]23OC[C@](CO)(O2)[C@@H](O)[C@H](O)[C@H]3O)cc1