Reaction Details
Target5-hydroxytryptamine receptor 1A
LigandBDBM50343259
Substrate/Competitorn/a
Meas. Tech.ChEMBL_745649 (CHEMBL1776019)
Ki 11.4±n/a nM
Citation Johnson, DSChoi, CFay, LKFavor, DARepine, JTWhite, ADAkunne, HCFitzgerald, LNicholls, KSnyder, BJWhetzel, SZZhang, LSerpa, KA Discovery of PF-00217830: aryl piperazine napthyridinones as D2 partial agonists for schizophrenia and bipolar disorder. Bioorg Med Chem Lett21:2621-5 (2011) 
 
5-hydroxytryptamine receptor 1A
Name:5-hydroxytryptamine receptor 1A
Type:n/a
Mol. Mass.:46122.49
Organism:Homo sapiens (Human)
Description:n/a
Residue:422
BDBM50343259
NameBDBM50343259
Synonyms:7-(5-(4-(2,3-dichlorophenyl)piperazin-1-yl)pentyl)-3,4-dihydro-1,8-naphthyridin-2(1H)-one | CHEMBL1774062
TypeSmall organic molecule
Emp. Form.C23H28Cl2N4O
Mol. Mass.447.401
SMILESClc1cccc(N2CCN(CCCCCc3ccc4CCC(=O)Nc4n3)CC2)c1Cl