Reaction Details
TargetMetabotropic glutamate receptor 2
LigandBDBM50343316
Substrate/Competitorn/a
Meas. Tech.ChEMBL_745697 (CHEMBL1776067)
EC50 454±n/a nM
Citation Zhang, LBrodney, MACandler, JDoran, ACDuplantier, AJEfremov, IVEvrard, EKraus, KGanong, AHHaas, JAHanks, ANJenza, KLazzaro, JTMaklad, NMcCarthy, SAQian, WRogers, BNRottas, MDSchmidt, CJSiuciak, JATingley, FDZhang, AQ 1-[(1-methyl-1H-imidazol-2-yl)methyl]-4-phenylpiperidines as mGluR2 positive allosteric modulators for the treatment of psychosis. J Med Chem54:1724-39 (2011) 
 
Metabotropic glutamate receptor 2
Name:Metabotropic glutamate receptor 2
Type:Enzyme
Mol. Mass.:95584.88
Organism:Homo sapiens (Human)
Description:Q14416
Residue:872
BDBM50343316
NameBDBM50343316
Synonyms:CHEMBL1774224 | cis-1-methyl-2-(((2R,4R)-2-methyl-4-(4-(trifluoromethyl)phenyl)piperidin-1-yl)methyl)-1H-imidazo[4,5-b]pyridine
TypeSmall organic molecule
Emp. Form.C21H23F3N4
Mol. Mass.388.4293
SMILESC[C@@H]1C[C@@H](CCN1Cc1nc2ncccc2n1C)c1ccc(cc1)C(F)(F)F