Reaction Details
TargetD(2) dopamine receptor
LigandBDBM50343305
Substrate/Competitorn/a
Meas. Tech.ChEMBL_745694 (CHEMBL1776064)
Ki 91±n/a nM
Citation Zhang, LBrodney, MACandler, JDoran, ACDuplantier, AJEfremov, IVEvrard, EKraus, KGanong, AHHaas, JAHanks, ANJenza, KLazzaro, JTMaklad, NMcCarthy, SAQian, WRogers, BNRottas, MDSchmidt, CJSiuciak, JATingley, FDZhang, AQ 1-[(1-methyl-1H-imidazol-2-yl)methyl]-4-phenylpiperidines as mGluR2 positive allosteric modulators for the treatment of psychosis. J Med Chem54:1724-39 (2011) 
 
D(2) dopamine receptor
Name:D(2) dopamine receptor
Type:G Protein-Coupled Receptor (GPCR)
Mol. Mass.:50931.60
Organism:Rattus norvegicus (rat)
Description:P61169
Residue:444
BDBM50343305
NameBDBM50343305
Synonyms:2-((4-(4-Chloro-2-fluorophenyl)piperidin-1-yl)methyl)-1-methyl-1H-benzo[d]imidazole | CHEMBL1774107
TypeSmall organic molecule
Emp. Form.C20H21ClFN3
Mol. Mass.357.852
SMILESCn1c(CN2CCC(CC2)c2ccc(Cl)cc2F)nc2ccccc12