Reaction Details
TargetD(2) dopamine receptor
LigandBDBM50343319
Substrate/Competitorn/a
Meas. Tech.ChEMBL_745694 (CHEMBL1776064)
Ki>2800±n/a nM
Citation Zhang, LBrodney, MACandler, JDoran, ACDuplantier, AJEfremov, IVEvrard, EKraus, KGanong, AHHaas, JAHanks, ANJenza, KLazzaro, JTMaklad, NMcCarthy, SAQian, WRogers, BNRottas, MDSchmidt, CJSiuciak, JATingley, FDZhang, AQ 1-[(1-methyl-1H-imidazol-2-yl)methyl]-4-phenylpiperidines as mGluR2 positive allosteric modulators for the treatment of psychosis. J Med Chem54:1724-39 (2011) 
 
D(2) dopamine receptor
Name:D(2) dopamine receptor
Type:G Protein-Coupled Receptor (GPCR)
Mol. Mass.:50931.60
Organism:Rattus norvegicus (rat)
Description:P61169
Residue:444
BDBM50343319
NameBDBM50343319
Synonyms:CHEMBL1774227 cis-rac-1-methyl-2-(((3R,4R)-3-methyl-4-(4-(trifluoromethyl)phenyl)piperidin-1-yl)methyl)-1H-imidazo[4,5-b]pyridine
TypeSmall organic molecule
Emp. Form.C21H23F3N4
Mol. Mass.388.4293
SMILESC[C@H]1CN(Cc2nc3ncccc3n2C)CC[C@H]1c1ccc(cc1)C(F)(F)F