Reaction Details
TargetD(2) dopamine receptor
LigandBDBM50343323
Substrate/Competitorn/a
Meas. Tech.ChEMBL_745694 (CHEMBL1776064)
Ki>5260±n/a nM
Citation Zhang, LBrodney, MACandler, JDoran, ACDuplantier, AJEfremov, IVEvrard, EKraus, KGanong, AHHaas, JAHanks, ANJenza, KLazzaro, JTMaklad, NMcCarthy, SAQian, WRogers, BNRottas, MDSchmidt, CJSiuciak, JATingley, FDZhang, AQ 1-[(1-methyl-1H-imidazol-2-yl)methyl]-4-phenylpiperidines as mGluR2 positive allosteric modulators for the treatment of psychosis. J Med Chem54:1724-39 (2011) 
 
D(2) dopamine receptor
Name:D(2) dopamine receptor
Type:G Protein-Coupled Receptor (GPCR)
Mol. Mass.:50931.60
Organism:Rattus norvegicus (rat)
Description:P61169
Residue:444
BDBM50343323
NameBDBM50343323
Synonyms:CHEMBL1774231 | cis-2-(((3R,4R)-4-(2-methoxy-4-(trifluoromethyl)phenyl)-3-methylpiperidin-1-yl)methyl)-1-methyl-1H-imidazo[4,5-b]pyridine
TypeSmall organic molecule
Emp. Form.C22H25F3N4O
Mol. Mass.418.4553
SMILESCOc1cc(ccc1[C@@H]1CCN(Cc2nc3ncccc3n2C)C[C@@H]1C)C(F)(F)F