Reaction Details
TargetTyrosine-protein kinase ABL1
LigandBDBM50343417
Substrate/Competitorn/a
Meas. Tech.ChEMBL_745920 (CHEMBL1776290)
Ki 660±n/a nM
Citation Radi, MDreassi, EBrullo, CCrespan, ETintori, CBernardo, VValoti, MZamperini, CDaigl, HMusumeci, FCarraro, FNaldini, AFilippi, IMaga, GSchenone, SBotta, M Design, synthesis, biological activity, and ADME properties of pyrazolo[3,4-d]pyrimidines active in hypoxic human leukemia cells: a lead optimization study. J Med Chem54:2610-26 (2011) 
 
Tyrosine-protein kinase ABL1
Name:Tyrosine-protein kinase ABL1
Type:Enzyme
Mol. Mass.:122897.30
Organism:Homo sapiens (Human)
Description:P00519
Residue:1130
BDBM50343417
NameBDBM50343417
Synonyms:1-[2-Chloro-2-(4-chlorophenyl)ethyl]-N-(pyridin-4-ylmethyl)-1Hpyrazolo[3,4-d]pyrimidin-4-amine | CHEMBL1775046
TypeSmall organic molecule
Emp. Form.C19H16Cl2N6
Mol. Mass.399.277
SMILESClC(Cn1ncc2c(NCc3ccncc3)ncnc12)c1ccc(Cl)cc1