Reaction Details
TargetProto-oncogene tyrosine-protein kinase Src
LigandBDBM50343422
Substrate/Competitorn/a
Meas. Tech.ChEMBL_745919 (CHEMBL1776289)
Ki 3000±n/a nM
Citation Radi, MDreassi, EBrullo, CCrespan, ETintori, CBernardo, VValoti, MZamperini, CDaigl, HMusumeci, FCarraro, FNaldini, AFilippi, IMaga, GSchenone, SBotta, M Design, synthesis, biological activity, and ADME properties of pyrazolo[3,4-d]pyrimidines active in hypoxic human leukemia cells: a lead optimization study. J Med Chem54:2610-26 (2011) 
 
Proto-oncogene tyrosine-protein kinase Src
Name:Proto-oncogene tyrosine-protein kinase Src
Type:Protein
Mol. Mass.:59838.60
Organism:Homo sapiens (Human)
Description:P12931
Residue:536
BDBM50343422
NameBDBM50343422
Synonyms:1-[2-Chloro-2-(4-fluorophenyl)ethyl]-N-(pyridin-4-ylmethyl)-1Hpyrazolo[3,4-d]pyrimidin-4-amine | CHEMBL1775047
TypeSmall organic molecule
Emp. Form.C19H16ClFN6
Mol. Mass.382.822
SMILESFc1ccc(cc1)C(Cl)Cn1ncc2c(NCc3ccncc3)ncnc12