Reaction Details
TargetMatrix protein 2 [1-96]
LigandBDBM50343541
Substrate/Competitorn/a
Meas. Tech.ChEMBL_747076 (CHEMBL1777442)
IC50 7100±n/a nM
Citation Duque, MDMa, CTorres, EWang, JNaesens, LJuárez-Jiménez, JCamps, PLuque, FJDeGrado, WFLamb, RAPinto, LHVázquez, S Exploring the size limit of templates for inhibitors of the M2 ion channel of influenza A virus. J Med Chem54:2646-57 (2011) 
 
Matrix protein 2 [1-96]
Name:Matrix protein 2 [1-96]
Type:PROTEIN
Mol. Mass.:11051.96
Organism:Influenza A virus
Description:ChEMBL_1453980
Residue:96
BDBM50343541
NameBDBM50343541
Synonyms:C-(Hexahydro-2,5-methano-pentalen-3a-yl)-methylamine [(Tricyclo[3.3.1.03,7]non-3-yl)methyl]amine
TypeSmall organic molecule
Emp. Form.C10H17N
Mol. Mass.151.2487
SMILESNCC12CC3CC1CC(C2)C3