Reaction Details
TargetMatrix protein 2 [1-96]
LigandBDBM50343542
Substrate/Competitorn/a
Meas. Tech.ChEMBL_747076 (CHEMBL1777442)
IC50 17100±n/a nM
Citation Duque, MDMa, CTorres, EWang, JNaesens, LJuárez-Jiménez, JCamps, PLuque, FJDeGrado, WFLamb, RAPinto, LHVázquez, S Exploring the size limit of templates for inhibitors of the M2 ion channel of influenza A virus. J Med Chem54:2646-57 (2011) 
 
Matrix protein 2 [1-96]
Name:Matrix protein 2 [1-96]
Type:PROTEIN
Mol. Mass.:11051.96
Organism:Influenza A virus
Description:ChEMBL_1453980
Residue:96
BDBM50343542
NameBDBM50343542
Synonyms:(Hexahydro-2,5-methano-pentalen-3a-ylmethyl)-methyl-amine N-Methyl[(tricyclo[3.3.1.03,7]non-3-yl)methyl]amine
TypeSmall organic molecule
Emp. Form.C11H19N
Mol. Mass.165.2753
SMILESCNCC12CC3CC1CC(C2)C3