Reaction Details
TargetMatrix protein 2 [1-96]
LigandBDBM50343543
Substrate/Competitorn/a
Meas. Tech.ChEMBL_747076 (CHEMBL1777442)
IC50 2400±n/a nM
Citation Duque, MDMa, CTorres, EWang, JNaesens, LJuárez-Jiménez, JCamps, PLuque, FJDeGrado, WFLamb, RAPinto, LHVázquez, S Exploring the size limit of templates for inhibitors of the M2 ion channel of influenza A virus. J Med Chem54:2646-57 (2011) 
 
Matrix protein 2 [1-96]
Name:Matrix protein 2 [1-96]
Type:PROTEIN
Mol. Mass.:11051.96
Organism:Influenza A virus
Description:ChEMBL_1453980
Residue:96
BDBM50343543
NameBDBM50343543
Synonyms:CHEMBL499125 N-[(Tricyclo[3.3.1.03,7]non-3-yl)methyl]guanidine
TypeSmall organic molecule
Emp. Form.C11H19N3
Mol. Mass.193.2887
SMILES[#7]\[#6](-[#7])=[#7]/[#6]C12[#6]-[#6]-3-[#6]-[#6]1-[#6]-[#6](-[#6]2)-[#6]-3