Reaction Details
TargetMatrix protein 2 [1-96]
LigandBDBM50343548
Substrate/Competitorn/a
Meas. Tech.ChEMBL_747076 (CHEMBL1777442)
IC50 22900±n/a nM
Citation Duque, MDMa, CTorres, EWang, JNaesens, LJuárez-Jiménez, JCamps, PLuque, FJDeGrado, WFLamb, RAPinto, LHVázquez, S Exploring the size limit of templates for inhibitors of the M2 ion channel of influenza A virus. J Med Chem54:2646-57 (2011) 
 
Matrix protein 2 [1-96]
Name:Matrix protein 2 [1-96]
Type:PROTEIN
Mol. Mass.:11051.96
Organism:Influenza A virus
Description:ChEMBL_1453980
Residue:96
BDBM50343548
NameBDBM50343548
Synonyms:CHEMBL468166 N-Methyl(2-oxaadamant-1-yl)amine
TypeSmall organic molecule
Emp. Form.C10H17NO
Mol. Mass.167.2481
SMILESCNC12CC3CC(CC(C3)O1)C2