Reaction Details
TargetMatrix protein 2 [1-96]
LigandBDBM50343549
Substrate/Competitorn/a
Meas. Tech.ChEMBL_747076 (CHEMBL1777442)
IC50 33500±n/a nM
Citation Duque, MDMa, CTorres, EWang, JNaesens, LJuárez-Jiménez, JCamps, PLuque, FJDeGrado, WFLamb, RAPinto, LHVázquez, S Exploring the size limit of templates for inhibitors of the M2 ion channel of influenza A virus. J Med Chem54:2646-57 (2011) 
 
Matrix protein 2 [1-96]
Name:Matrix protein 2 [1-96]
Type:PROTEIN
Mol. Mass.:11051.96
Organism:Influenza A virus
Description:ChEMBL_1453980
Residue:96
BDBM50343549
NameBDBM50343549
Synonyms:3-Azahexacyclo[7.6.0.0(1,5).0(5,12).0(6,10).0(11,15)]pentadeca-7,13-diene Hydrochloride | CHEMBL1774319
TypeSmall organic molecule
Emp. Form.C14H15N
Mol. Mass.197.2756
SMILESC1NCC23C4C=CC5C4C4C(C=CC24)C135