Reaction Details
TargetSerine/threonine-protein kinase mTOR
LigandBDBM50343765
Substrate/Competitorn/a
Meas. Tech.ChEMBL_747578 (CHEMBL1777159)
Ki 2.6±n/a nM
Citation Cohen, FBergeron, PBlackwood, EBowman, KKChen, HDipasquale, AGEpler, JAKoehler, MFLau, KLewis, CLiu, LLy, CQMalek, SNonomiya, JOrtwine, DFPei, ZRobarge, KDSideris, STrinh, LTruong, TWu, JZhao, XLyssikatos, JP Potent, selective, and orally bioavailable inhibitors of mammalian target of rapamycin (mTOR) kinase based on a quaternary substituted dihydrofuropyrimidine. J Med Chem54:3426-35 (2011) 
 
Serine/threonine-protein kinase mTOR
Name:Serine/threonine-protein kinase mTOR
Type:Rapamycin target protein
Mol. Mass.:288917.12
Organism:Homo sapiens (Human)
Description:P42345
Residue:2549
BDBM50343765
NameBDBM50343765
Synonyms:1-(4-(7,7-Dimethyl-4-morpholino-5-oxo-5,7-dihydrofuro[3,4-d]pyrimidin-2-yl)phenyl)-3-ethylurea | CHEMBL1774354
TypeSmall organic molecule
Emp. Form.C21H25N5O4
Mol. Mass.411.4543
SMILESCCNC(=O)Nc1ccc(cc1)-c1nc2c(C(=O)OC2(C)C)c(n1)N1CCOCC1