Reaction Details
TargetSerine/threonine-protein kinase mTOR
LigandBDBM50343774
Substrate/Competitorn/a
Meas. Tech.ChEMBL_747578 (CHEMBL1777159)
Ki 0.7±n/a nM
Citation Cohen, FBergeron, PBlackwood, EBowman, KKChen, HDipasquale, AGEpler, JAKoehler, MFLau, KLewis, CLiu, LLy, CQMalek, SNonomiya, JOrtwine, DFPei, ZRobarge, KDSideris, STrinh, LTruong, TWu, JZhao, XLyssikatos, JP Potent, selective, and orally bioavailable inhibitors of mammalian target of rapamycin (mTOR) kinase based on a quaternary substituted dihydrofuropyrimidine. J Med Chem54:3426-35 (2011) 
 
Serine/threonine-protein kinase mTOR
Name:Serine/threonine-protein kinase mTOR
Type:Rapamycin target protein
Mol. Mass.:288917.12
Organism:Homo sapiens (Human)
Description:P42345
Residue:2549
BDBM50343774
NameBDBM50343774
Synonyms:1-Ethyl-3-(4-((S)-7-(2-hydroxyethyl)-7-methyl-4-((S)-3-methylmorpholino)-5,7-dihydrofuro[3,4-d]pyrimidin-2-yl)phenyl)urea | CHEMBL1774363
TypeSmall organic molecule
Emp. Form.C23H31N5O4
Mol. Mass.441.5233
SMILESCCNC(=O)Nc1ccc(cc1)-c1nc2c(CO[C@@]2(C)CCO)c(n1)N1CCOC[C@@H]1C