Reaction Details
TargetSerine/threonine-protein kinase mTOR
LigandBDBM50343779
Substrate/Competitorn/a
Meas. Tech.ChEMBL_747584 (CHEMBL1777165)
IC50 28±n/a nM
Citation Cohen, FBergeron, PBlackwood, EBowman, KKChen, HDipasquale, AGEpler, JAKoehler, MFLau, KLewis, CLiu, LLy, CQMalek, SNonomiya, JOrtwine, DFPei, ZRobarge, KDSideris, STrinh, LTruong, TWu, JZhao, XLyssikatos, JP Potent, selective, and orally bioavailable inhibitors of mammalian target of rapamycin (mTOR) kinase based on a quaternary substituted dihydrofuropyrimidine. J Med Chem54:3426-35 (2011) 
 
Serine/threonine-protein kinase mTOR
Name:Serine/threonine-protein kinase mTOR
Type:Rapamycin target protein
Mol. Mass.:288917.12
Organism:Homo sapiens (Human)
Description:P42345
Residue:2549
BDBM50343779
NameBDBM50343779
Synonyms:1-(4-((R)-4-((1R,5S)-8-oxa-3-azabicyclo[3.2.1]octan-3-yl)-7-(2-hydroxyethyl)-7-methyl-5,7-dihydrofuro[3,4-d]pyrimidin-2-yl)phenyl)-3-ethylurea | CHEMBL1774368
TypeSmall organic molecule
Emp. Form.C24H31N5O4
Mol. Mass.453.534
SMILESCCNC(=O)Nc1ccc(cc1)-c1nc2c(CO[C@]2(C)CCO)c(n1)N1C[C@@H]2CC[C@H](C1)O2